Target
Bromodomain-containing protein 4
Ligand
BDBM50092312
Substrate
Meas. Tech.
ChEMBL_1569678 (CHEMBL3791151)
IC50
<20±n/a nM
Citation
 Romero, FATaylor, AMCrawford, TDTsui, VCôté, AMagnuson, S Disrupting Acetyl-Lysine Recognition: Progress in the Development of Bromodomain Inhibitors. J Med Chem 59:1271-98 (2016)  
Target
Name:
Bromodomain-containing protein 4
Synonyms:
BRD4 Bromodomain-containing protein 4 (BRD4) Protein HUNK1
Type:
Protein
Mol. Mass.:
152264.84
Organism:
Homo sapiens (Human)
Description:
O60885
Residue:
1362
  
Inhibitor
Name:
BDBM50092312
Synonyms:
Birabresib OTX-015
Type:
Small organic molecule
Emp. Form.:
C25H22ClN5O2S
Mol. Mass.:
491.992
SMILES:
[H][C@@]1(CC(=O)Nc2ccc(O)cc2)N=C(c2c(C)c(C)sc2-n2c(C)nnc12)c1ccc(Cl)cc1
: