Target
Bromodomain-containing protein 4
Ligand
BDBM50158612
Substrate
Meas. Tech.
ChEMBL_1569653 (CHEMBL3791126)
IC50
14±n/a nM
Citation
 Romero, FATaylor, AMCrawford, TDTsui, VCôté, AMagnuson, S Disrupting Acetyl-Lysine Recognition: Progress in the Development of Bromodomain Inhibitors. J Med Chem 59:1271-98 (2016)  
Target
Name:
Bromodomain-containing protein 4
Synonyms:
BRD4 Bromodomain-containing protein 4 (BRD4) Protein HUNK1
Type:
Protein
Mol. Mass.:
152264.84
Organism:
Homo sapiens (Human)
Description:
O60885
Residue:
1362
  
Inhibitor
Name:
BDBM50158612
Synonyms:
CHEMBL3787075 | US9493483, 401
Type:
Small organic molecule
Emp. Form.:
C24H20ClN5O2
Mol. Mass.:
445.901
SMILES:
Cc1noc2[C@H](CC(N)=O)N=C(c3ccc(Cl)cc3)c3cc(ccc3-c12)-c1cnn(C)c1
: