Target
CREB-binding protein
Ligand
BDBM50158615
Substrate
Meas. Tech.
ChEMBL_1569632 (CHEMBL3790858)
Kd
19600±n/a nM
Citation
 Romero, FATaylor, AMCrawford, TDTsui, VCôté, AMagnuson, S Disrupting Acetyl-Lysine Recognition: Progress in the Development of Bromodomain Inhibitors. J Med Chem 59:1271-98 (2016)  
Target
Name:
CREB-binding protein
Synonyms:
CBP CREB-binding protein (CBP) CREBBP
Type:
Transcription Coactivator
Mol. Mass.:
265411.66
Organism:
Homo sapiens (Human)
Description:
Q92793
Residue:
2442
  
Inhibitor
Name:
BDBM50158615
Synonyms:
Ischemin
Type:
Small organic molecule
Emp. Form.:
C15H17N3O4S
Mol. Mass.:
335.378
SMILES:
Cc1cc(\N=N\c2cc(c(C)cc2C)S(O)(=O)=O)c(N)cc1O
: