Target
Bromodomain-containing protein 4
Ligand
BDBM50158689
Substrate
Meas. Tech.
ChEMBL_1569674 (CHEMBL3791147)
IC50
20±n/a nM
Citation
 Romero, FATaylor, AMCrawford, TDTsui, VCôté, AMagnuson, S Disrupting Acetyl-Lysine Recognition: Progress in the Development of Bromodomain Inhibitors. J Med Chem 59:1271-98 (2016)  
Target
Name:
Bromodomain-containing protein 4
Synonyms:
BRD4 Bromodomain-containing protein 4 (BRD4) Protein HUNK1
Type:
Protein
Mol. Mass.:
152264.84
Organism:
Homo sapiens (Human)
Description:
O60885
Residue:
1362
  
Inhibitor
Name:
BDBM50158689
Synonyms:
CHEMBL3786971
Type:
Small organic molecule
Emp. Form.:
C25H30N4O5S
Mol. Mass.:
498.595
SMILES:
CNC(=O)N1N=C(c2ccc(cc2)N2CC3(CCS3(=O)=O)C2)c2cc(OC)c(OC)cc2CC1C
: