Target
Bromodomain-containing protein 4
Ligand
BDBM50158690
Substrate
Meas. Tech.
ChEMBL_1569673 (CHEMBL3791146)
IC50
<100±n/a nM
Citation
 Romero, FATaylor, AMCrawford, TDTsui, VCôté, AMagnuson, S Disrupting Acetyl-Lysine Recognition: Progress in the Development of Bromodomain Inhibitors. J Med Chem 59:1271-98 (2016)  
Target
Name:
Bromodomain-containing protein 4
Synonyms:
BRD4 Bromodomain-containing protein 4 (BRD4) Protein HUNK1
Type:
Protein
Mol. Mass.:
152264.84
Organism:
Homo sapiens (Human)
Description:
O60885
Residue:
1362
  
Inhibitor
Name:
BDBM50158690
Synonyms:
CHEMBL3785122
Type:
Small organic molecule
Emp. Form.:
C25H26N4O5
Mol. Mass.:
462.4977
SMILES:
COc1ccc(OC(=O)N2C[C@H](C)N(C(C)=O)c3ccc(cc23)-c2cnn(c2)C2COC2)cc1
: