Target
Bromodomain-containing protein 4
Ligand
BDBM50365463
Substrate
Meas. Tech.
ChEMBL_1569630 (CHEMBL3790856)
IC50
120±n/a nM
Citation
 Romero, FATaylor, AMCrawford, TDTsui, VCôté, AMagnuson, S Disrupting Acetyl-Lysine Recognition: Progress in the Development of Bromodomain Inhibitors. J Med Chem 59:1271-98 (2016)  
Target
Name:
Bromodomain-containing protein 4
Synonyms:
BRD4 Bromodomain-containing protein 4 (BRD4) Protein HUNK1
Type:
Protein
Mol. Mass.:
152264.84
Organism:
Homo sapiens (Human)
Description:
O60885
Residue:
1362
  
Inhibitor
Name:
BDBM50365463
Synonyms:
CHEMBL1232461
Type:
Small organic molecule
Emp. Form.:
C22H22ClN5O2
Mol. Mass.:
423.895
SMILES:
CCNC(=O)C[C@@H]1N=C(c2ccc(Cl)cc2)c2cc(OC)ccc2-n2c(C)nnc12
: