Target
Coagulation factor X
Ligand
BDBM50158151
Substrate
Meas. Tech.
ChEMBL_1565757 (CHEMBL3782597)
Ki
510±n/a nM
Citation
 Venukadasula, PKOwusu, BYBansal, NRoss, LJHobrath, JVBao, DTruss, JWStackhouse, MMessick, TEKlampfer, LGalemmo, RA Design and Synthesis of Nonpeptide Inhibitors of Hepatocyte Growth Factor Activation. ACS Med Chem Lett 7:177-81 (2016)  
Target
Name:
Coagulation factor X
Synonyms:
Activated coagulation factor X (FXa) Coagulation factor X precursor F10 Factor X heavy chain Factor Xa Stuart-Prower factor
Type:
Enzyme
Mol. Mass.:
54726.60
Organism:
Homo sapiens (Human)
Description:
Residue:
488
  
Inhibitor
Name:
BDBM50158151
Synonyms:
CHEMBL3780273
Type:
Small organic molecule
Emp. Form.:
C25H34N6O3S
Mol. Mass.:
498.641
SMILES:
CS(=O)(=O)NC1CN(CC2CCN(Cc3ccccc3)CC2)C(=O)N(C1)c1cccc(c1)C(N)=N
: