Target
Protein arginine N-methyltransferase 6
Ligand
BDBM50068109
Substrate
Meas. Tech.
ChEMBL_1564181 (CHEMBL3784078)
IC50
104000±n/a nM
Citation
 Ferreira de Freitas, REram, MSSzewczyk, MMSteuber, HSmil, DWu, HLi, FSenisterra, GDong, ABrown, PJHitchcock, MMoosmayer, DStegmann, CMEgner, UArrowsmith, CBarsyte-Lovejoy, DVedadi, MSchapira, M Discovery of a Potent Class I Protein Arginine Methyltransferase Fragment Inhibitor. J Med Chem 59:1176-83 (2016)  
Target
Name:
Protein arginine N-methyltransferase 6
Synonyms:
ANM6_HUMAN Heterogeneous nuclear ribonucleoprotein methyltransferase-like protein 6 PRMT6 | Protein arginine methyltransferase 6 (PRMT6)
Type:
Protein
Mol. Mass.:
41928.48
Organism:
Homo sapiens (Human)
Description:
Residue:
375
  
Inhibitor
Name:
BDBM50068109
Synonyms:
CHEMBL3402235
Type:
Small organic molecule
Emp. Form.:
C13H14N2
Mol. Mass.:
198.2637
SMILES:
CNCc1cccc(c1)-c1cccnc1
: