Target
Acetylcholinesterase
Ligand
BDBM8961
Substrate
Meas. Tech.
ChEMBL_1564345 (CHEMBL3784772)
IC50
2.0±n/a nM
Citation
 Telpoukhovskaia, MAPatrick, BORodríguez-Rodríguez, COrvig, C In silico to in vitro screening of hydroxypyridinones as acetylcholinesterase inhibitors. Bioorg Med Chem Lett 26:1624-8 (2016)  
Target
Name:
Acetylcholinesterase
Synonyms:
ACES_ELEEL Acetylcholinesterase (EeAChE) | ache
Type:
Enzyme
Mol. Mass.:
71812.79
Organism:
Electrophorus electricus (Electric eel)
Description:
Residue:
633
  
Inhibitor
Name:
BDBM8961
Synonyms:
1,2,3,4-tetrahydro-9-acridinamine 9-THA CHEMBL1337960 Cognex Tracine cid_1935 | tacrine.HCl
Type:
Small organic molecule
Emp. Form.:
C13H14N2
Mol. Mass.:
198.2637
SMILES:
Nc1c2CCCCc2nc2ccccc12
: