Target
Lysine-specific demethylase 4C
Ligand
BDBM50158859
Substrate
Meas. Tech.
ChEMBL_1566332 (CHEMBL3789211)
IC50
<100±n/a nM
Citation
 McAllister, TEEngland, KSHopkinson, RJBrennan, PEKawamura, ASchofield, CJ Recent Progress in Histone Demethylase Inhibitors. J Med Chem 59:1308-29 (2016)  
Target
Name:
Lysine-specific demethylase 4C
Synonyms:
GASC-1 protein Gene amplified in squamous cell carcinoma 1 protein JMJD2C Jumonji domain-containing protein 2C KDM4C_HUMAN | KIAA0780
Type:
Protein
Mol. Mass.:
119979.01
Organism:
Homo sapiens (Human)
Description:
Q9H3R0
Residue:
1056
  
Inhibitor
Name:
BDBM50158859
Synonyms:
CHEMBL3787193
Type:
Small organic molecule
Emp. Form.:
C16H26N4O3
Mol. Mass.:
322.4026
SMILES:
CCN(CCN(C)C)C(=O)CNCc1cc(ccn1)C(=O)OC
: