Target
Lysine-specific demethylase 5B
Ligand
BDBM191599
Substrate
Meas. Tech.
ChEMBL_1566333 (CHEMBL3789212)
IC50
100±n/a nM
Citation
 McAllister, TEEngland, KSHopkinson, RJBrennan, PEKawamura, ASchofield, CJ Recent Progress in Histone Demethylase Inhibitors. J Med Chem 59:1308-29 (2016)  
Target
Name:
Lysine-specific demethylase 5B
Synonyms:
CT31 Histone demethylase JARID1B Jumonji/ARID domain-containing protein 1B KDM5B_HUMAN Lysine-specific demethylase 5B (KDM5Flag-5B-FL) PLU1 RBP2-H1 | Retinoblastoma-binding protein 2 homolog 1
Type:
Protein
Mol. Mass.:
175659.67
Organism:
Homo sapiens (Human)
Description:
Q9UGL1
Residue:
1544
  
Inhibitor
Name:
BDBM191599
Synonyms:
KDOAM-21 | ethyl 2-(((2-((2-(dimethylamino)ethyl)(ethyl)amino)-2-oxoethyl)amino)methyl)isonicotinate (KDM5-C70)
Type:
Small organic molecule
Emp. Form.:
C17H28N4O3
Mol. Mass.:
336.4292
SMILES:
CCOC(=O)c1ccnc(CNCC(=O)N(CC)CCN(C)C)c1
: