Target
Lysine-specific demethylase 6A
Ligand
BDBM50158859
Substrate
Meas. Tech.
ChEMBL_1566335 (CHEMBL3789214)
IC50
<100±n/a nM
Citation
 McAllister, TEEngland, KSHopkinson, RJBrennan, PEKawamura, ASchofield, CJ Recent Progress in Histone Demethylase Inhibitors. J Med Chem 59:1308-29 (2016)  
Target
Name:
Lysine-specific demethylase 6A
Synonyms:
Histone demethylase UTX KDM6A_HUMAN Lysine-specific demethylase 6A (KDM6A(UTX)) UTX Ubiquitously-transcribed X chromosome tetratricopeptide repeat protein
Type:
Protein
Mol. Mass.:
154198.48
Organism:
Homo sapiens (Human)
Description:
O15550
Residue:
1401
  
Inhibitor
Name:
BDBM50158859
Synonyms:
CHEMBL3787193
Type:
Small organic molecule
Emp. Form.:
C16H26N4O3
Mol. Mass.:
322.4026
SMILES:
CCN(CCN(C)C)C(=O)CNCc1cc(ccn1)C(=O)OC
: