Target
Lysine-specific histone demethylase 1A
Ligand
BDBM50158863
Substrate
Meas. Tech.
ChEMBL_1565792 (CHEMBL3789177)
IC50
<100±n/a nM
Citation
 McAllister, TEEngland, KSHopkinson, RJBrennan, PEKawamura, ASchofield, CJ Recent Progress in Histone Demethylase Inhibitors. J Med Chem 59:1308-29 (2016)  
Target
Name:
Lysine-specific histone demethylase 1A
Synonyms:
AOF2 Flavin-containing amine oxidase domain-containing protein 2 KDM1A KIAA0601 Lysine-specific demethylase 1 (LSD1) Lysine-specific histone demethylase 1 (LSD1)
Type:
Enzyme
Mol. Mass.:
92901.01
Organism:
Homo sapiens (Human)
Description:
O60341
Residue:
852
  
Inhibitor
Name:
BDBM50158863
Synonyms:
CHEMBL3785706
Type:
Small organic molecule
Emp. Form.:
C27H34N4O
Mol. Mass.:
430.5851
SMILES:
CN(C)CC(=O)N1CCC(CN[C@@H]2C[C@H]2c2ccccc2)(Cc2cccc(c2)C#N)CC1
: