Target
Lysine-specific histone demethylase 1A
Ligand
BDBM50158880
Substrate
Meas. Tech.
ChEMBL_1565803 (CHEMBL3789188)
IC50
<10.0±n/a nM
Citation
 McAllister, TEEngland, KSHopkinson, RJBrennan, PEKawamura, ASchofield, CJ Recent Progress in Histone Demethylase Inhibitors. J Med Chem 59:1308-29 (2016)  
Target
Name:
Lysine-specific histone demethylase 1A
Synonyms:
AOF2 Flavin-containing amine oxidase domain-containing protein 2 KDM1A KIAA0601 Lysine-specific demethylase 1 (LSD1) Lysine-specific histone demethylase 1 (LSD1)
Type:
Enzyme
Mol. Mass.:
92901.01
Organism:
Homo sapiens (Human)
Description:
O60341
Residue:
852
  
Inhibitor
Name:
BDBM50158880
Synonyms:
CHEMBL3785783 US10543198, Example 16 | US10864202, Example 16
Type:
Small organic molecule
Emp. Form.:
C23H23N5
Mol. Mass.:
369.4622
SMILES:
Cc1ccc(cc1)-c1cnc(NC[C@H]2CCNC2)nc1-c1ccc(cc1)C#N
: