Target
Lysine-specific histone demethylase 1A
Ligand
BDBM50158886
Substrate
Meas. Tech.
ChEMBL_1566028 (CHEMBL3791186)
Ki
2600±n/a nM
Citation
 McAllister, TEEngland, KSHopkinson, RJBrennan, PEKawamura, ASchofield, CJ Recent Progress in Histone Demethylase Inhibitors. J Med Chem 59:1308-29 (2016)  
Target
Name:
Lysine-specific histone demethylase 1A
Synonyms:
AOF2 Flavin-containing amine oxidase domain-containing protein 2 KDM1A KIAA0601 Lysine-specific demethylase 1 (LSD1) Lysine-specific histone demethylase 1 (LSD1)
Type:
Enzyme
Mol. Mass.:
92901.01
Organism:
Homo sapiens (Human)
Description:
O60341
Residue:
852
  
Inhibitor
Name:
BDBM50158886
Synonyms:
CHEMBL3787012
Type:
Small organic molecule
Emp. Form.:
C30H56N10O7S
Mol. Mass.:
700.893
SMILES:
CSCC[C@H](NC(=O)[C@H](CO)NC(=O)[C@H](CCCNC(N)=N)NC(=O)[C@@H]1CCCN1)C(=O)N[C@@H](CC(C)C)C(=O)N[C@@H](C(C)C)C(N)=O
: