Target
Sodium channel protein type 9 subunit alpha
Ligand
BDBM50158894
Substrate
Meas. Tech.
ChEMBL_1566350 (CHEMBL3789454)
IC50
2.0±n/a nM
Citation
 Blass, B Sulfonamide Compounds as Voltage Gated Sodium Channel Modulators. ACS Med Chem Lett 6:1168-70 (2015)  
Target
Name:
Sodium channel protein type 9 subunit alpha
Synonyms:
NENA Peripheral sodium channel 1 SCN9A_HUMAN Voltage-gated sodium channel subunit Nav1.7 hNE-Na
Type:
Protein
Mol. Mass.:
226375.97
Organism:
Homo sapiens (Human)
Description:
Q15858
Residue:
1988
  
Inhibitor
Name:
BDBM50158894
Synonyms:
CHEMBL3786756
Type:
Small organic molecule
Emp. Form.:
C22H19F4N3O3S2
Mol. Mass.:
513.528
SMILES:
FC(F)(F)c1ccc(C2CCOc3cc(ccc23)S(=O)(=O)Nc2nccs2)c(c1)C1(F)CNC1
: