Target
Type-1 angiotensin II receptor
Ligand
BDBM50159159
Substrate
Meas. Tech.
ChEMBL_1568947 (CHEMBL3789066)
Ki
13±n/a nM
Citation
 Keller, MKuhn, KKEinsiedel, JHübner, HBiselli, SMollereau, CWifling, DSvobodová, JBernhardt, GCabrele, CVanderheyden, PMGmeiner, PBuschauer, A Mimicking of Arginine by Functionalized N(¿)-Carbamoylated Arginine As a New Broadly Applicable Approach to Labeled Bioactive Peptides: High Affinity Angiotensin, Neuropeptide Y, Neuropeptide FF, and Neurotensin Receptor Ligands As Examples. J Med Chem 59:1925-45 (2016)  
Target
Name:
Type-1 angiotensin II receptor
Synonyms:
AGTR1 AGTR1B AT1 AT1BR AT2R1B Angiotensin II receptor Type-1 angiotensin II receptor (AT1)
Type:
Protein
Mol. Mass.:
41080.75
Organism:
Homo sapiens (Human)
Description:
P30556
Residue:
359
  
Inhibitor
Name:
BDBM50159159
Synonyms:
CHEMBL3786195
Type:
Small organic molecule
Emp. Form.:
C95H122BrF12N17O22
Mol. Mass.:
2161.971
SMILES:
[Br-].OC(=O)C(F)(F)F.OC(=O)C(F)(F)F.OC(=O)C(F)(F)F.OC(=O)C(F)(F)F.CCC(C)C(NC(=O)C(Cc1ccc(O)cc1)NC(=O)C(NC(=O)C(CCCN\C(N)=N\C(=O)NCCCCNC(=O)CCCCCN1\C(=C/C=C/C=C/C2=[N+](C)c3ccccc3C2(C)C)C(C)(C)c2ccccc12)NC(=O)C(N)CC(O)=O)C(C)C)C(=O)NC(Cc1cnc[nH]1)C(=O)N1CCCC1C(=O)NC(Cc1ccccc1)C(O)=O
: