Target
Transmembrane domain-containing protein TMIGD3
Ligand
BDBM50163883
Substrate
Meas. Tech.
ChEMBL_1573808 (CHEMBL3803229)
Ki
124±n/a nM
Citation
 Tosh, DKCiancetta, AWarnick, EO'Connor, RChen, ZGizewski, ECrane, SGao, ZGAuchampach, JASalvemini, DJacobson, KA Purine (N)-Methanocarba Nucleoside Derivatives Lacking an Exocyclic Amine as Selective A3 Adenosine Receptor Agonists. J Med Chem 59:3249-63 (2016)  
Target
Name:
Transmembrane domain-containing protein TMIGD3
Synonyms:
TMIG3_HUMAN Transmembrane domain-containing protein TMIGD3
Type:
PROTEIN
Mol. Mass.:
30335.79
Organism:
Homo sapiens (Human)
Description:
ChEMBL_114868
Residue:
266
  
Inhibitor
Name:
BDBM50163883
Synonyms:
CHEMBL3800509
Type:
Small organic molecule
Emp. Form.:
C21H17F2N5O3
Mol. Mass.:
425.3882
SMILES:
[H][C@]12C[C@]1([C@@H](O)[C@@H](O)[C@@H]2n1cnc2cnc(nc12)C#Cc1ccc(F)c(F)c1)C(=O)NC
: