Target
Transmembrane domain-containing protein TMIGD3
Ligand
BDBM50163879
Substrate
Meas. Tech.
ChEMBL_1573808 (CHEMBL3803229)
Ki
1480±n/a nM
Citation
 Tosh, DKCiancetta, AWarnick, EO'Connor, RChen, ZGizewski, ECrane, SGao, ZGAuchampach, JASalvemini, DJacobson, KA Purine (N)-Methanocarba Nucleoside Derivatives Lacking an Exocyclic Amine as Selective A3 Adenosine Receptor Agonists. J Med Chem 59:3249-63 (2016)  
Target
Name:
Transmembrane domain-containing protein TMIGD3
Synonyms:
TMIG3_HUMAN Transmembrane domain-containing protein TMIGD3
Type:
PROTEIN
Mol. Mass.:
30335.79
Organism:
Homo sapiens (Human)
Description:
ChEMBL_114868
Residue:
266
  
Inhibitor
Name:
BDBM50163879
Synonyms:
CHEMBL3798076
Type:
Small organic molecule
Emp. Form.:
C19H19N7O4
Mol. Mass.:
409.3987
SMILES:
[H][C@]12C[C@]1([C@@H](O)[C@@H](O)[C@@H]2n1cnc2cnc(\C=C(/O)c3cnccn3)nc12)C(=O)NC
: