Target
Melanocyte-stimulating hormone receptor
Ligand
BDBM50164797
Substrate
Meas. Tech.
ChEMBL_1576041 (CHEMBL3803373)
IC50
28±n/a nM
Citation
 Lensing, CJFreeman, KTSchnell, SMAdank, DNSpeth, RCHaskell-Luevano, C An in Vitro and in Vivo Investigation of Bivalent Ligands That Display Preferential Binding and Functional Activity for Different Melanocortin Receptor Homodimers. J Med Chem 59:3112-28 (2016)  
Target
Name:
Melanocyte-stimulating hormone receptor
Synonyms:
MC1-R Mc1r Melanocyte-stimulating hormone receptor | Msh-r
Type:
PROTEIN
Mol. Mass.:
35238.60
Organism:
Mus musculus
Description:
ChEMBL_1498846
Residue:
315
  
Inhibitor
Name:
BDBM50164797
Synonyms:
CHEMBL3797808
Type:
Small organic molecule
Emp. Form.:
C108H141N33O21
Mol. Mass.:
2237.4836
SMILES:
CC(=O)NC(Cc1cnc[nH]1)C(=O)NC(Cc1ccccc1)C(=O)NC(CCCNC(N)=N)C(=O)NC(Cc1c[nH]c2ccccc12)C(=O)N1CCCC1C(=O)NCC(=O)N1CCCC1C(=O)NCC(=O)N1CCCC1C(=O)NCC(=O)N1CCCC1C(=O)NCC(=O)N1CCCC1C(=O)NCC(=O)N1CCCC1C(=O)NCC(=O)NC(Cc1cnc[nH]1)C(=O)NC(Cc1ccccc1)C(=O)NC(CCCNC(N)=N)C(=O)NC(Cc1c[nH]c2ccccc12)C(N)=O
: