Target
Calmodulin
Ligand
BDBM50001888
Substrate
Meas. Tech.
ChEMBL_1576539 (CHEMBL3803979)
IC50
8000±n/a nM
Citation
 Bruno, CCavalluzzi, MMRusciano, MRLovece, ACarrieri, APracella, RGiannuzzi, GPolimeno, LViale, MIllario, MFranchini, CLentini, G The chemosensitizing agent lubeluzole binds calmodulin and inhibits Ca(2+)/calmodulin-dependent kinase II. Eur J Med Chem 116:36-45 (2016)  
Target
Name:
Calmodulin
Synonyms:
CALM CAM
Type:
PROTEIN
Mol. Mass.:
16813.73
Organism:
Bos taurus
Description:
ChEMBL_1458985
Residue:
149
  
Inhibitor
Name:
BDBM50001888
Synonyms:
(chloropromazine) [3-(2-Chloro-phenothiazin-10-yl)-propyl]-dimethyl-amine 1-(2-Allyl-phenoxy)-3-isopropylamino-propan-2-ol 3-(2-chloro-10H-phenothiazin-10-yl)-N,N-dimethylpropan-1-amine CHLORPROMAZINE CHLORPROMAZINE HYDROCHLORIDE CHLORPROMAZINE TANNATE PROMAPAR THORAZINE [3-(2-Chloro-phenothiazin-10-yl)-propyl]-dimethyl-amine( Chlorpromazine) chloropromazine | med.21724, Compound 15
Type:
Small organic molecule
Emp. Form.:
C17H19ClN2S
Mol. Mass.:
318.864
SMILES:
CN(C)CCCN1c2ccccc2Sc2ccc(Cl)cc12
: