Target
Intestinal-type alkaline phosphatase
Ligand
BDBM50165140
Substrate
Meas. Tech.
ChEMBL_1572749 (CHEMBL3804258)
Ki
2180±n/a nM
Citation
 al-Rashida, MBatool, GSattar, AEjaz, SAKhan, SLecka, JSévigny, JHameed, AIqbal, J 2-Alkoxy-3-(sulfonylarylaminomethylene)-chroman-4-ones as potent and selective inhibitors of ectonucleotidases. Eur J Med Chem 115:484-94 (2016)  
Target
Name:
Intestinal-type alkaline phosphatase
Synonyms:
ALPI Intestinal alkaline phosphatase (IAP) PPBI_BOVIN
Type:
Protein
Mol. Mass.:
57094.82
Organism:
Bos taurus (Cattle)
Description:
P19111
Residue:
533
  
Inhibitor
Name:
BDBM50165140
Synonyms:
CHEMBL3797297
Type:
Small organic molecule
Emp. Form.:
C18H18N2O5S
Mol. Mass.:
374.411
SMILES:
COC1Oc2ccc(C)cc2C(=O)\C1=C/Nc1ccccc1S(N)(=O)=O
: