Target
5'-nucleotidase
Ligand
BDBM50437943
Substrate
Meas. Tech.
ChEMBL_1572756 (CHEMBL3804265)
Ki
178±n/a nM
Citation
 al-Rashida, MBatool, GSattar, AEjaz, SAKhan, SLecka, JSévigny, JHameed, AIqbal, J 2-Alkoxy-3-(sulfonylarylaminomethylene)-chroman-4-ones as potent and selective inhibitors of ectonucleotidases. Eur J Med Chem 115:484-94 (2016)  
Target
Name:
5'-nucleotidase
Synonyms:
5'-nucleotidase Ecto-5'-nucleotidase (e5'NT) NT Nt5e | Nte
Type:
Enzyme
Mol. Mass.:
63971.44
Organism:
Rattus norvegicus (Rat)
Description:
P21588
Residue:
576
  
Inhibitor
Name:
BDBM50437943
Synonyms:
CHEMBL1814395
Type:
Small organic molecule
Emp. Form.:
C20H22N2O5S
Mol. Mass.:
402.464
SMILES:
CCOC1Oc2ccc(CC)cc2C(=O)C1=CNc1ccc(cc1)S(N)(=O)=O
: