Target
5-hydroxytryptamine receptor 2C
Ligand
BDBM50165320
Substrate
Meas. Tech.
ChEMBL_1572989 (CHEMBL3801703)
Ki
>10000±n/a nM
Citation
 Bielenica, AKedzierska, EKolinski, MKmiecik, SKolinski, AFiorino, FSeverino, BMagli, ECorvino, ARossi, IMassarelli, PKoziol, AESawczenko, AStruga, M 5-HT2 receptor affinity, docking studies and pharmacological evaluation of a series of 1,3-disubstituted thiourea derivatives. Eur J Med Chem 116:173-186 (2016)  
Target
Name:
5-hydroxytryptamine receptor 2C
Synonyms:
5-HT2C 5-hydroxytryptamine receptor 2C (5HT2c) 5ht1c Htr2c Serotonin receptor 2a and 2c (5HT2A and 5HT2C)
Type:
Enzyme
Mol. Mass.:
51935.10
Organism:
Rattus norvegicus (Rat)
Description:
P08909
Residue:
460
  
Inhibitor
Name:
BDBM50165320
Synonyms:
CHEMBL3799165
Type:
Small organic molecule
Emp. Form.:
C15H14ClN3O2S
Mol. Mass.:
335.809
SMILES:
CC(NC(=S)Nc1ccc(Cl)c(c1)[N+]([O-])=O)c1ccccc1
: