Target
Growth hormone secretagogue receptor type 1
Ligand
BDBM50165588
Substrate
Meas. Tech.
ChEMBL_1574213 (CHEMBL3802218)
Temperature
298.15±n/a K
Ki
3.0±n/a nM
Comments
extracted
Citation
 Maingot, MBlayo, ALDenoyelle, SM'Kadmi, CDamian, MMary, SGagne, DSanchez, PAicher, BSchmidt, PMüller, GTeifel, MGünther, EMarie, JBanères, JLMartinez, JFehrentz, JA New ligands of the ghrelin receptor based on the 1,2,4-triazole scaffold by introduction of a second chiral center. Bioorg Med Chem Lett 26:2408-12 (2016)  
Target
Name:
Growth hormone secretagogue receptor type 1
Synonyms:
GH-releasing peptide receptor GHS-R GHSR_HUMAN Ghrelin receptor | Ghrelin receptor 1a (GHS-R1a)
Type:
Receptor
Mol. Mass.:
41334.57
Organism:
Homo sapiens (Human)
Description:
Receptor binding studies use plasma membranes from LLC PK-1 cells transiently transfected with hGHSR1a.
Residue:
366
  
Inhibitor
Name:
BDBM50165588
Synonyms:
CHEMBL3800422
Type:
Small organic molecule
Emp. Form.:
C48H61N9O6
Mol. Mass.:
860.0546
SMILES:
COc1ccc(Cn2c(nnc2[C@@H](Cc2c[nH]c3ccccc23)NC(=O)C(C)(C)O)[C@@H](Cc2c[nH]c3ccccc23)NC(=O)[C@H](CC(C)C)NC(=O)[C@H](CC(C)C)NC(C)=O)cc1
: