Target
Leucine-rich repeat serine/threonine-protein kinase 2
Ligand
BDBM50166072
Substrate
Meas. Tech.
ChEMBL_1575146 (CHEMBL3804654)
Ki
92±n/a nM
Citation
 Greshock, TJSanders, JMDrolet, RERajapakse, HAChang, RKKim, BRada, VLTiscia, HESu, HLai, MTSur, SMSanchez, RIBilodeau, MTRenger, JJKern, JTMcCauley, JA Potent, selective and orally bioavailable leucine-rich repeat kinase 2 (LRRK2) inhibitors. Bioorg Med Chem Lett 26:2631-5 (2016)  
Target
Name:
Leucine-rich repeat serine/threonine-protein kinase 2
Synonyms:
Dardarin LRRK2_HUMAN Leucine-rich repeat serine/threonine-protein kinase 2 PARK8
Type:
Protein
Mol. Mass.:
286113.20
Organism:
Homo sapiens (Human)
Description:
Q5S007
Residue:
2527
  
Inhibitor
Name:
BDBM50166072
Synonyms:
CHEMBL3800174
Type:
Small organic molecule
Emp. Form.:
C17H14FN3OS2
Mol. Mass.:
359.441
SMILES:
CSc1sc(-c2cc[nH]n2)c2CC(NC(=O)c12)c1ccc(F)cc1
: