Target
D(2) dopamine receptor
Ligand
BDBM50167063
Substrate
Meas. Tech.
ChEMBL_1573522 (CHEMBL3801477)
Ki
17±n/a nM
Citation
 Weichert, DStanek, MHübner, HGmeiner, P Structure-guided development of dualß2 adrenergic/dopamine D2 receptor agonists. Bioorg Med Chem 24:2641-53 (2016)  
Target
Name:
D(2) dopamine receptor
Synonyms:
D(2) dopamine receptor DOPAMINE D2 Long DRD2 Dopamine D2 receptor Dopamine D2 receptor (D2R) Dopamine2-like | d2
Type:
Cell-surface receptors
Mol. Mass.:
50647.10
Organism:
Homo sapiens (Human)
Description:
P14416
Residue:
443
  
Inhibitor
Name:
BDBM50167063
Synonyms:
CHEMBL3800341
Type:
Small organic molecule
Emp. Form.:
C28H32N2O5
Mol. Mass.:
476.5641
SMILES:
COc1cc(CCNCCc2ccc(O)c3NC(=O)COc23)ccc1OCCCc1ccccc1
: