Target
D(2) dopamine receptor
Ligand
BDBM50167070
Substrate
Meas. Tech.
ChEMBL_1573522 (CHEMBL3801477)
Ki
60±n/a nM
Citation
 Weichert, DStanek, MHübner, HGmeiner, P Structure-guided development of dualß2 adrenergic/dopamine D2 receptor agonists. Bioorg Med Chem 24:2641-53 (2016)  
Target
Name:
D(2) dopamine receptor
Synonyms:
D(2) dopamine receptor DOPAMINE D2 Long DRD2 Dopamine D2 receptor Dopamine D2 receptor (D2R) Dopamine2-like | d2
Type:
Cell-surface receptors
Mol. Mass.:
50647.10
Organism:
Homo sapiens (Human)
Description:
P14416
Residue:
443
  
Inhibitor
Name:
BDBM50167070
Synonyms:
CHEMBL3799986
Type:
Small organic molecule
Emp. Form.:
C10H19N3S
Mol. Mass.:
213.343
SMILES:
CCCN[C@@H]1CCC2N=C(N)SC2C1
: