Target
D(3) dopamine receptor
Ligand
BDBM50167063
Substrate
Meas. Tech.
ChEMBL_1573523 (CHEMBL3801478)
Ki
3.5±n/a nM
Citation
 Weichert, DStanek, MHübner, HGmeiner, P Structure-guided development of dualß2 adrenergic/dopamine D2 receptor agonists. Bioorg Med Chem 24:2641-53 (2016)  
Target
Name:
D(3) dopamine receptor
Synonyms:
DOPAMINE D3 DRD3_HUMAN Dopamine D3 receptor (D3) Dopamine receptor Dopamine receptor D3
Type:
Mol. Mass.:
44243.43
Organism:
Homo sapiens (Human)
Description:
Residue:
400
  
Inhibitor
Name:
BDBM50167063
Synonyms:
CHEMBL3800341
Type:
Small organic molecule
Emp. Form.:
C28H32N2O5
Mol. Mass.:
476.5641
SMILES:
COc1cc(CCNCCc2ccc(O)c3NC(=O)COc23)ccc1OCCCc1ccccc1
: