Target
NAD-dependent protein deacetylase sirtuin-2
Ligand
BDBM50168905
Substrate
Meas. Tech.
ChEMBL_1577530 (CHEMBL3806939)
Ki
73±n/a nM
Citation
 Ai, TWilson, DJMore, SSXie, JChen, L 5-((3-Amidobenzyl)oxy)nicotinamides as Sirtuin 2 Inhibitors. J Med Chem 59:2928-41 (2016)  
Target
Name:
NAD-dependent protein deacetylase sirtuin-2
Synonyms:
NAD-Dependent Deacetylase Sirtuin-2 NAD-dependent deacetylase sirtuin 3 SIR2-like SIR2L SIR2_HUMAN Sirtuin 2 (SIRT2)
Type:
Hydrolase
Mol. Mass.:
43172.62
Organism:
Homo sapiens (Human)
Description:
Residue:
389
  
Inhibitor
Name:
BDBM50168905
Synonyms:
CHEMBL3805692
Type:
Small organic molecule
Emp. Form.:
C24H24N4O4
Mol. Mass.:
432.4718
SMILES:
NC(=O)c1cncc(OCc2cccc(NC(=O)c3ccc(cc3)N3CCOCC3)c2)c1
: