Target
Hexokinase-2
Ligand
BDBM50169013
Substrate
Meas. Tech.
ChEMBL_1577563 (CHEMBL3807039)
Ki
2900±n/a nM
Citation
 Lin, HZeng, JXie, RSchulz, MJTedesco, RQu, JErhard, KFMack, JFRaha, KRendina, ARSzewczuk, LMKratz, PMJurewicz, AJCecconie, TMartens, SMcDevitt, PJMartin, JDChen, SBJiang, YNickels, LSchwartz, BJSmallwood, AZhao, BCampobasso, NQian, YBriand, JRominger, CMOleykowski, CHardwicke, MALuengo, JI Discovery of a Novel 2,6-Disubstituted Glucosamine Series of Potent and Selective Hexokinase 2 Inhibitors. ACS Med Chem Lett 7:217-22 (2016)  
Target
Name:
Hexokinase-2
Synonyms:
HK II HXK2_HUMAN Hexokinase-2 | Muscle form hexokinase
Type:
PROTEIN
Mol. Mass.:
102369.70
Organism:
Homo sapiens (Human)
Description:
ChEMBL_11422
Residue:
917
  
Inhibitor
Name:
BDBM50169013
Synonyms:
CHEMBL3805703
Type:
Small organic molecule
Emp. Form.:
C15H17Cl2NO6
Mol. Mass.:
378.205
SMILES:
OC[C@H]1OC(O)[C@H](NC(=O)\C=C\c2ccc(Cl)c(Cl)c2)[C@@H](O)[C@@H]1O
: