Target
Poly [ADP-ribose] polymerase tankyrase-2
Ligand
BDBM50169060
Substrate
Meas. Tech.
ChEMBL_1577626 (CHEMBL3807234)
IC50
0.190±n/a nM
Citation
 Abdel-Magid, AF Potential Use of Inhibitors of Tankyrases and PARP-1 as Treatment for Cancer and Other Diseases. ACS Med Chem Lett 7:209-10 (2016)  
Target
Name:
Poly [ADP-ribose] polymerase tankyrase-2
Synonyms:
(ARTD6 or PARP5b) Poly [ADP-ribose] polymerase tankyrase-2 TNKL TNKS2_HUMAN Tankyrase 2 Tankyrase-2 Tankyrase-2 (TNKS2)
Type:
Enzyme
Mol. Mass.:
126937.16
Organism:
Homo sapiens (Human)
Description:
Q9H2K2
Residue:
1166
  
Inhibitor
Name:
BDBM50169060
Synonyms:
CHEMBL3804939
Type:
Small organic molecule
Emp. Form.:
C25H29N3O4S
Mol. Mass.:
467.58
SMILES:
COc1ccc(cc1C)C(=O)C1CCN(CC1)C(=O)CCCc1nc2c(C)scc2c(=O)[nH]1
: