Target
Poly [ADP-ribose] polymerase 1
Ligand
BDBM50169059
Substrate
Meas. Tech.
ChEMBL_1577624 (CHEMBL3807232)
IC50
120±n/a nM
Citation
 Abdel-Magid, AF Potential Use of Inhibitors of Tankyrases and PARP-1 as Treatment for Cancer and Other Diseases. ACS Med Chem Lett 7:209-10 (2016)  
Target
Name:
Poly [ADP-ribose] polymerase 1
Synonyms:
(ARTD1 or PARP1) 2.4.2.30 ADPRT ARTD1 Human diphtheria toxin-like ADP-ribosyltransferase (ARTD1 or PARP1) NT-PARP-1 PARP1 PPOL Poly [ADP-ribose] polymerase 1 (PARP) Poly [ADP-ribose] polymerase 1 (PARP1) Poly [ADP-ribose] polymerase 1, 28-kDa form Poly [ADP-ribose] polymerase 1, processed C-terminus Poly [ADP-ribose] polymerase-1 Poly(ADP-ribose) polymerase-1 (ARTD1/PARP1) Protein poly-ADP-ribosyltransferase PARP1 | Synonyms=ADPRT
Type:
Mol. Mass.:
113114.22
Organism:
Homo sapiens (Human)
Description:
P09874
Residue:
1014
  
Inhibitor
Name:
BDBM50169059
Synonyms:
CHEMBL3805627
Type:
Small organic molecule
Emp. Form.:
C23H25N5O3
Mol. Mass.:
419.4763
SMILES:
Cc1ccc2n1nc(CCCC(=O)N1CCC(CC1)Oc1ccc(cc1)C#N)[nH]c2=O
: