Target
Poly [ADP-ribose] polymerase tankyrase-1
Ligand
BDBM50169057
Substrate
Meas. Tech.
ChEMBL_1577625 (CHEMBL3807233)
IC50
0.180±n/a nM
Citation
 Abdel-Magid, AF Potential Use of Inhibitors of Tankyrases and PARP-1 as Treatment for Cancer and Other Diseases. ACS Med Chem Lett 7:209-10 (2016)  
Target
Name:
Poly [ADP-ribose] polymerase tankyrase-1
Synonyms:
(ARTD5 or PARP5a) PARPL Poly [ADP-ribose] polymerase tankyrase-1 TINF1 TNKS1 Tankyrase 1 Tankyrase-1 Tankyrase-1 (TNKS1)
Type:
Enzyme
Mol. Mass.:
142058.03
Organism:
Homo sapiens (Human)
Description:
O95271
Residue:
1327
  
Inhibitor
Name:
BDBM50169057
Synonyms:
CHEMBL3805896
Type:
Small organic molecule
Emp. Form.:
C25H29N3O4
Mol. Mass.:
435.5155
SMILES:
COc1ccc(cc1)C(=O)C1CCN(CC1)C(=O)CCCc1cn2c(C)ccc2c(=O)[nH]1
: