Target
Beta-secretase 1
Ligand
BDBM50169365
Substrate
Meas. Tech.
ChEMBL_1577901 (CHEMBL3806438)
IC50
2.3±n/a nM
Citation
 Wu, YJGuernon, JYang, FSnyder, LShi, JMcclure, ARajamani, RPark, HNg, ALewis, HChang, CCamac, DToyn, JHAhlijanian, MKAlbright, CFMacor, JEThompson, LA Targeting the BACE1 Active Site Flap Leads to a Potent Inhibitor That Elicits Robust Brain Aß Reduction in Rodents. ACS Med Chem Lett 7:271-6 (2016)  
Target
Name:
Beta-secretase 1
Synonyms:
ASP2 Aspartyl protease 2 BACE1 Beta-secretase (BACE) Beta-secretase 1 (BACE 1) Beta-secretase 1 (BACE1) Beta-site amyloid precursor protein cleaving enzyme 1 Memapsin-2 beta-Secretase (BACE-1) | beta-Secretase (BACE1)
Type:
Protein
Mol. Mass.:
55755.10
Organism:
Homo sapiens (Human)
Description:
P56817
Residue:
501
  
Inhibitor
Name:
BDBM50169365
Synonyms:
CHEMBL3806215
Type:
Small organic molecule
Emp. Form.:
C22H21ClFN5O2S
Mol. Mass.:
473.951
SMILES:
Cc1noc(C)c1[C@@H]1C[C@](C)(N=C(N)S1)c1cc(F)cc(NC(=O)c2ccc(Cl)cn2)c1
: