Target
Sodium channel protein type 9 subunit alpha
Ligand
BDBM50169424
Substrate
Meas. Tech.
ChEMBL_1577992 (CHEMBL3806691)
IC50
17±n/a nM
Citation
 Focken, TLiu, SChahal, NDauphinais, MGrimwood, MEChowdhury, SHemeon, IBichler, PBogucki, DWaldbrook, MBankar, GSojo, LEYoung, CLin, SShuart, NKwan, RPang, JChang, JHSafina, BSSutherlin, DPJohnson, JPDehnhardt, CMMansour, TSOballa, RMCohen, CJRobinette, CL Discovery of Aryl Sulfonamides as Isoform-Selective Inhibitors of NaV1.7 with Efficacy in Rodent Pain Models. ACS Med Chem Lett 7:277-82 (2016)  
Target
Name:
Sodium channel protein type 9 subunit alpha
Synonyms:
NENA Peripheral sodium channel 1 SCN9A_HUMAN Voltage-gated sodium channel subunit Nav1.7 hNE-Na
Type:
Protein
Mol. Mass.:
226375.97
Organism:
Homo sapiens (Human)
Description:
Q15858
Residue:
1988
  
Inhibitor
Name:
BDBM50169424
Synonyms:
CHEMBL3805265 | US9481677, 30
Type:
Small organic molecule
Emp. Form.:
C21H12ClF2N5O3S2
Mol. Mass.:
519.931
SMILES:
Fc1cc(c(F)cc1Oc1ccc(Cl)cc1-c1cccc2nccn12)S(=O)(=O)Nc1ncns1
: