Target
Sodium channel protein type 5 subunit alpha
Ligand
BDBM50169431
Substrate
Meas. Tech.
ChEMBL_1577993 (CHEMBL3806692)
IC50
>10000±n/a nM
Citation
 Focken, TLiu, SChahal, NDauphinais, MGrimwood, MEChowdhury, SHemeon, IBichler, PBogucki, DWaldbrook, MBankar, GSojo, LEYoung, CLin, SShuart, NKwan, RPang, JChang, JHSafina, BSSutherlin, DPJohnson, JPDehnhardt, CMMansour, TSOballa, RMCohen, CJRobinette, CL Discovery of Aryl Sulfonamides as Isoform-Selective Inhibitors of NaV1.7 with Efficacy in Rodent Pain Models. ACS Med Chem Lett 7:277-82 (2016)  
Target
Name:
Sodium channel protein type 5 subunit alpha
Synonyms:
HH1 SCN5A_HUMAN Sodium channel protein type 5 subunit alpha/beta-1/beta-2 Voltage-gated sodium channel subunit alpha Nav1.5
Type:
Enzyme
Mol. Mass.:
226908.60
Organism:
Homo sapiens (Human)
Description:
Q14524
Residue:
2016
  
Inhibitor
Name:
BDBM50169431
Synonyms:
CHEMBL3805722 | US9481677, 73
Type:
Small organic molecule
Emp. Form.:
C21H12ClF2N5O3S2
Mol. Mass.:
519.931
SMILES:
Fc1cc(c(F)cc1Oc1ccc(Cl)cc1-c1ccc2[nH]cnc2c1)S(=O)(=O)Nc1ncns1
: