Target
Sphingosine 1-phosphate receptor 4
Ligand
BDBM23163
Substrate
Meas. Tech.
ChEMBL_1578114 (CHEMBL3807069)
EC50
0.090000±n/a nM
Citation
 Dhar, TGXiao, HYXie, JLehman-McKeeman, LDWu, DRDabros, MYang, XTaylor, TLZhou, XDHeimrich, EMThomas, RMcIntyre, KWWarrack, BShi, HLevesque, PCZhu, JLHennan, JBalimane, PYang, ZMarino, AMCornelius, GD'Arienzo, CJMathur, AShen, DRCvijic, MESalter-Cid, LBarrish, JCCarter, PHDyckman, AJ Identification and Preclinical Pharmacology of BMS-986104: A Differentiated S1P1 Receptor Modulator in Clinical Trials. ACS Med Chem Lett 7:283-8 (2016)  
Target
Name:
Sphingosine 1-phosphate receptor 4
Synonyms:
EDG6 S1P receptor 4 S1P4 S1PR4_HUMAN Sphingosine 1-phosphate receptor Edg-6 sphingosine-1-phosphate 4 S1P4
Type:
G Protein-Coupled Receptor (GPCR)
Mol. Mass.:
41647.39
Organism:
Homo sapiens (Human)
Description:
Residue:
384
  
Inhibitor
Name:
BDBM23163
Synonyms:
CHEMBL114606 {2-amino-3-hydroxy-2-[2-(4-octylphenyl)ethyl]propoxy}phosphonic acid
Type:
Small organic molecule
Emp. Form.:
C19H34NO5P
Mol. Mass.:
387.4507
SMILES:
CCCCCCCCc1ccc(CCC(N)(CO)COP(O)(O)=O)cc1
: