Target
5-hydroxytryptamine receptor 2C
Ligand
BDBM50171392
Substrate
Meas. Tech.
ChEMBL_1576970 (CHEMBL3806883)
IC50
190±n/a nM
Citation
 Yang, FJiang, XLi, JWang, YLiu, YBi, MWu, CZhao, QChen, WYin, JZhang, JXie, YHu, TXu, MGuo, SWang, ZHe, YShen, J Synthesis, structure-activity relationships, and biological evaluation of a series of benzamides as potential multireceptor antipsychotics. Bioorg Med Chem Lett 26:3141-7 (2016)  
Target
Name:
5-hydroxytryptamine receptor 2C
Synonyms:
5-HT-2C 5-HT2C-INI 5-HTR2C 5-hydroxytryptamine receptor 2C (5-HT-2C) 5HT-1C HTR1C Serotonin (5-HT3) receptor Serotonin Receptor 2C
Type:
G Protein-Coupled Receptor (GPCR)
Mol. Mass.:
51836.79
Organism:
Homo sapiens (Human)
Description:
P28335
Residue:
458
  
Inhibitor
Name:
BDBM50171392
Synonyms:
CHEMBL3805559
Type:
Small organic molecule
Emp. Form.:
C24H28FN3O3
Mol. Mass.:
425.4958
SMILES:
CNC(=O)c1cccc(OCCCCN2CCC(CC2)c2noc3cc(F)ccc23)c1
: