Target
D(2) dopamine receptor
Ligand
BDBM50171476
Substrate
Meas. Tech.
ChEMBL_1576957 (CHEMBL3806800)
IC50
35±n/a nM
Citation
 Yang, FJiang, XLi, JWang, YLiu, YBi, MWu, CZhao, QChen, WYin, JZhang, JXie, YHu, TXu, MGuo, SWang, ZHe, YShen, J Synthesis, structure-activity relationships, and biological evaluation of a series of benzamides as potential multireceptor antipsychotics. Bioorg Med Chem Lett 26:3141-7 (2016)  
Target
Name:
D(2) dopamine receptor
Synonyms:
D(2) dopamine receptor DOPAMINE D2 Long DRD2 Dopamine D2 receptor Dopamine D2 receptor (D2R) Dopamine2-like | d2
Type:
Cell-surface receptors
Mol. Mass.:
50647.10
Organism:
Homo sapiens (Human)
Description:
P14416
Residue:
443
  
Inhibitor
Name:
BDBM50171476
Synonyms:
CHEMBL3806224
Type:
Small organic molecule
Emp. Form.:
C22H26Cl3N3O2
Mol. Mass.:
470.82
SMILES:
CNC(=O)c1cc(OCCCCN2CCN(CC2)c2cccc(Cl)c2Cl)ccc1Cl
: