Target
Mu-type opioid receptor
Ligand
BDBM50173127
Substrate
Meas. Tech.
ChEMBL_1579557 (CHEMBL3810903)
Ki
5.0±n/a nM
Citation
 Guillemyn, KStarnowska, JLagard, CDyniewicz, JRojewska, EMika, JChung, NNUtard, VKosson, PLipkowski, AWChevillard, LArranz-Gibert, PTeixidó, MMegarbane, BTourwé, DSimonin, FPrzewlocka, BSchiller, PWBallet, S Bifunctional Peptide-Based Opioid Agonist-Nociceptin Antagonist Ligands for Dual Treatment of Acute and Neuropathic Pain. J Med Chem 59:3777-92 (2016)  
Target
Name:
Mu-type opioid receptor
Synonyms:
M-OR-1 MOR-1 MUOR1 Mu opiate receptor OPRM1 hMOP | mu-type opioid receptor isoform MOR-1
Type:
G Protein-Coupled Receptor (GPCR)
Mol. Mass.:
44789.51
Organism:
Homo sapiens (Human)
Description:
P35372
Residue:
400
  
Inhibitor
Name:
BDBM50173127
Synonyms:
CHEMBL3808415
Type:
Small organic molecule
Emp. Form.:
C72H107N21O13
Mol. Mass.:
1474.7529
SMILES:
CC[C@H](C)[C@H](NC(=O)[C@H](CCCNC(N)=N)NC(=O)[C@H](Cc1ccc(O)cc1)NC(=O)[C@H](Cc1ccc(O)cc1)NC(=O)[C@H](CCCNC(N)=N)NC(=O)CCN1Cc2ccccc2C[C@H](NC(=O)[C@@H](CCCNC(N)=N)NC(=O)[C@@H](N)Cc2c(C)cc(O)cc2C)C1=O)C(=O)N[C@@H](CCCCN)C(N)=O
: