Target
Cytochrome P450 2C8
Ligand
BDBM50175303
Substrate
Meas. Tech.
ChEMBL_1581102 (CHEMBL3813400)
IC50
180±n/a nM
Citation
 Fader, LBrault, MDesjardins, JDansereau, NLamorte, LTremblay, SBilodeau, FBordeleau, JDuplessis, MGorys, VGillard, JGleason, JLJames, CJoly, MAKuhn, CLlinas-Brunet, MLuo, LMorency, LMorin, SParisien, MPoirier, MThibeault, CTrinh, TSturino, CSrivastava, SYoakim, CFranti, M Discovery of Potent, Orally Bioavailable Inhibitors of Human Cytomegalovirus. ACS Med Chem Lett 7:525-30 (2016)  
Target
Name:
Cytochrome P450 2C8
Synonyms:
CP2C8_HUMAN CYPIIC8 P450 IIC2 P450 form 1 | S-mephenytoin 4-hydroxylase
Type:
Protein
Mol. Mass.:
55839.23
Organism:
Homo sapiens (Human)
Description:
P10632
Residue:
490
  
Inhibitor
Name:
BDBM50175303
Synonyms:
CHEMBL3810042
Type:
Small organic molecule
Emp. Form.:
C23H20F3N5O3S
Mol. Mass.:
503.497
SMILES:
CC(C)OC(c1nc(c[nH]1)-n1ccc(NC(=O)c2cscn2)cc1=O)c1cccc(c1)C(F)(F)F
: