Target
Cytochrome P450 3A4
Ligand
BDBM50176904
Substrate
Meas. Tech.
ChEMBL_1581632 (CHEMBL3817395)
Kd
900±n/a nM
Citation
 Kaur, PChamberlin, ARPoulos, TLSevrioukova, IF Structure-Based Inhibitor Design for Evaluation of a CYP3A4 Pharmacophore Model. J Med Chem 59:4210-20 (2016)  
Target
Name:
Cytochrome P450 3A4
Synonyms:
Albendazole monooxygenase CP3A4_HUMAN CYP3A4 CYPIIIA4 Cytochrome P450 3A4 (CYP3A4) Nifedipine oxidase Taurochenodeoxycholate 6-alpha-hydroxylase
Type:
Enzyme
Mol. Mass.:
57349.57
Organism:
Homo sapiens (Human)
Description:
Residue:
503
  
Inhibitor
Name:
BDBM50176904
Synonyms:
CHEMBL3814479
Type:
Small organic molecule
Emp. Form.:
C23H31N3O3S
Mol. Mass.:
429.576
SMILES:
CC(C)(C)OC(=O)N[C@H](CSCCC(=O)NCc1cccnc1)Cc1ccccc1
: