Target
Oxysterols receptor LXR-beta
Ligand
BDBM50177014
Substrate
Meas. Tech.
ChEMBL_1582623 (CHEMBL3817031)
Ki
94±n/a nM
Citation
 Zheng, YZhuang, LFan, KYTice, CMZhao, WDong, CLotesta, SDLeftheris, KLindblom, PRLiu, ZShimada, JNoto, PBMeng, SHardy, AHoward, LKrosky, PGuo, JLipinski, KKandpal, GBukhtiyarov, YZhao, YLala, DVan Orden, RZhou, JChen, GWu, ZMcKeever, BMMcGeehan, GMGregg, REClaremon, DASingh, SB Discovery of a Novel, Orally Efficacious Liver X Receptor (LXR)ß Agonist. J Med Chem 59:3264-71 (2016)  
Target
Name:
Oxysterols receptor LXR-beta
Synonyms:
LXRB Liver X, LXR beta NR1H2 Nuclear receptor NER Ubiquitously-expressed nuclear receptor
Type:
Enzyme Catalytic Domain
Mol. Mass.:
50978.79
Organism:
Homo sapiens (Human)
Description:
P55055
Residue:
460
  
Inhibitor
Name:
BDBM50177014
Synonyms:
CHEMBL3813875
Type:
Small organic molecule
Emp. Form.:
C22H21F3N4O2S
Mol. Mass.:
462.488
SMILES:
CS(=O)(=O)c1cccc(c1)N1CCN(C(C1)c1ccccc1)c1nccc(n1)C(F)(F)F
: