Target
Probable G-protein coupled receptor 34
Ligand
BDBM50177123
Substrate
Meas. Tech.
ChEBML_1581710
EC50
708±n/a nM
Citation
 Jung, SInoue, ANakamura, SKishi, TUwamizu, ASayama, MIkubo, MOtani, YKano, KMakide, KAoki, JOhwada, T Conformational Constraint of the Glycerol Moiety of Lysophosphatidylserine Affords Compounds with Receptor Subtype Selectivity. J Med Chem 59:3750-76 (2016)  
Target
Name:
Probable G-protein coupled receptor 34
Synonyms:
G protein-coupled receptor 34 Gpr34 | Probable G-protein coupled receptor 34
Type:
PROTEIN
Mol. Mass.:
43201.40
Organism:
Mus musculus
Description:
ChEMBL_102842
Residue:
375
  
Inhibitor
Name:
BDBM50177123
Synonyms:
CHEMBL3815090
Type:
Small organic molecule
Emp. Form.:
C30H44NO9P
Mol. Mass.:
593.6454
SMILES:
CCCCCCCCCCCOc1ccccc1CCC(=O)OCc1ccccc1OP(O)(=O)OC[C@H](N)C(O)=O
: