Target
Probable G-protein coupled receptor 34
Ligand
BDBM50177130
Substrate
Meas. Tech.
ChEMBL_1581710 (CHEMBL3816043)
EC50
36±n/a nM
Citation
 Jung, SInoue, ANakamura, SKishi, TUwamizu, ASayama, MIkubo, MOtani, YKano, KMakide, KAoki, JOhwada, T Conformational Constraint of the Glycerol Moiety of Lysophosphatidylserine Affords Compounds with Receptor Subtype Selectivity. J Med Chem 59:3750-76 (2016)  
Target
Name:
Probable G-protein coupled receptor 34
Synonyms:
G protein-coupled receptor 34 Gpr34 | Probable G-protein coupled receptor 34
Type:
PROTEIN
Mol. Mass.:
43201.40
Organism:
Mus musculus
Description:
ChEMBL_102842
Residue:
375
  
Inhibitor
Name:
BDBM50177130
Synonyms:
CHEMBL3815069
Type:
Small organic molecule
Emp. Form.:
C32H38NO11P
Mol. Mass.:
643.618
SMILES:
Cc1ccc(Oc2cccc(COc3ccccc3CCC(=O)OC[C@H]3OCCC[C@H]3OP(O)(=O)OC[C@H](N)C(O)=O)c2)cc1
: