Target
Probable G-protein coupled receptor 34
Ligand
BDBM50177118
Substrate
Meas. Tech.
ChEMBL_1581710 (CHEMBL3816043)
EC50
110±n/a nM
Citation
 Jung, SInoue, ANakamura, SKishi, TUwamizu, ASayama, MIkubo, MOtani, YKano, KMakide, KAoki, JOhwada, T Conformational Constraint of the Glycerol Moiety of Lysophosphatidylserine Affords Compounds with Receptor Subtype Selectivity. J Med Chem 59:3750-76 (2016)  
Target
Name:
Probable G-protein coupled receptor 34
Synonyms:
G protein-coupled receptor 34 Gpr34 | Probable G-protein coupled receptor 34
Type:
PROTEIN
Mol. Mass.:
43201.40
Organism:
Mus musculus
Description:
ChEMBL_102842
Residue:
375
  
Inhibitor
Name:
BDBM50177118
Synonyms:
CHEMBL3814763
Type:
Small organic molecule
Emp. Form.:
C29H48NO10P
Mol. Mass.:
601.6659
SMILES:
CCCCCCCCCCCOc1ccccc1CCC(=O)OC[C@H]1OCCC[C@H]1OP(O)(=O)OC[C@H](N)C(O)=O
: