Target
Acyl-protein thioesterase 1
Ligand
BDBM50177780
Substrate
Meas. Tech.
ChEMBL_1581787 (CHEMBL3816313)
IC50
7300±n/a nM
Citation
 Wu, WLHao, JDomalski, MBurnett, DAPissarnitski, DZhao, ZStamford, AScapin, GGao, YDSoriano, AKelly, TMYao, ZPowles, MAChen, SMei, HHwa, J Discovery of Novel Tricyclic Heterocycles as Potent and Selective DPP-4 Inhibitors for the Treatment of Type 2 Diabetes. ACS Med Chem Lett 7:498-501 (2016)  
Target
Name:
Acyl-protein thioesterase 1
Synonyms:
Acyl-protein thioesterase 1/2 LYPA1_RAT Lysosomal phospholipase A1
Type:
PROTEIN
Mol. Mass.:
24708.49
Organism:
Rattus norvegicus
Description:
ChEMBL_12731
Residue:
230
  
Inhibitor
Name:
BDBM50177780
Synonyms:
CHEMBL3813856
Type:
Small organic molecule
Emp. Form.:
C22H23FN8O2
Mol. Mass.:
450.4688
SMILES:
CCN1C(=O)Cn2c1nc1nc(N3CCC[C@@H](N)C3)n(Cc3cc(F)ccc3C#N)c1c2=O
: