Target
Cathepsin E
Ligand
BDBM50178261
Substrate
Meas. Tech.
ChEMBL_1582465 (CHEMBL3816586)
IC50
23±n/a nM
Citation
 Al-Awadhi, FHRatnayake, RPaul, VJLuesch, H Tasiamide F, a potent inhibitor of cathepsins D and E from a marine cyanobacterium. Bioorg Med Chem 24:3276-82 (2016)  
Target
Name:
Cathepsin E
Synonyms:
3.4.23.34 CTSE Cathepsin E form II
Type:
Enzyme
Mol. Mass.:
43298.99
Organism:
Homo sapiens (Human)
Description:
P14091
Residue:
396
  
Inhibitor
Name:
BDBM50178261
Synonyms:
CHEMBL3813928
Type:
Small organic molecule
Emp. Form.:
C50H74N8O12
Mol. Mass.:
979.169
SMILES:
CC[C@H](C)[C@H](NC(=O)C[C@H](O)[C@H](Cc1ccccc1)NC(=O)[C@H](CCC(N)=O)N(C)C(=O)[C@@H](NC(=O)[C@H](C)O)[C@@H](C)CC)C(=O)NCC(=O)N(C)[C@H](Cc1ccccc1)C(=O)N1CCC[C@H]1C(=O)OC
: