Target
Cholesteryl ester transfer protein
Ligand
BDBM50178699
Substrate
Meas. Tech.
ChEMBL_1583724 (CHEMBL3815811)
IC50
1.8±n/a nM
Citation
 Jiang, JFinlay, HJohnson, JAHarikrishnan, LKamau, MQiao, JWang, TAdam, LTaylor, DYang, RSleph, PChen, AYAYin, XWexler, RSalvati, ME Discovery of hydroxyl 1,2-diphenylethanamine analogs as potent cholesterol ester transfer protein inhibitors. Bioorg Med Chem Lett 26:3278-3281 (2016)  
Target
Name:
Cholesteryl ester transfer protein
Synonyms:
CETP Cholesteryl ester transfer protein (CETP) | Lipid transfer protein I
Type:
Enzyme
Mol. Mass.:
54751.53
Organism:
Homo sapiens (Human)
Description:
P11597
Residue:
493
  
Inhibitor
Name:
BDBM50178699
Synonyms:
CHEMBL3813836
Type:
Small organic molecule
Emp. Form.:
C28H26F9NO3
Mol. Mass.:
595.4966
SMILES:
CC(C)Oc1cc(ccc1F)[C@@](Cc1ccccc1)(NC[C@@H](O)C(F)(F)F)c1cc(F)cc(OC(F)(F)C(F)F)c1
: